{"text_format":"1","workbook":"xlsx","n_sheets":4,"sheets":["Table of Contents","Surveyor Instructions","File List - completed by NCQA","File Review Worksheet"],"not_rendered":{"charts":0,"images":0,"macros":1,"external_links":0,"defined_names":0,"comments":0,"pivot_tables":0},"unopened":[],"bounds":{"document_bytes":16777216,"sheet_cells":100000,"rows_first":2000,"rows_last":500,"rows_between":2000,"halvings":0,"cell_chars":16384,"cell_head_chars":4096},"cells_cut":0,"cells_raw":0,"read":"whole","date_system":"1900"}

{"sheet":"Table of Contents","index":0,"n_rows":9,"n_cols":3,"rows_kept":9,"cut":false,"hidden":false,"merged":[[0,0,0,2],[1,0,1,2]]}
["CM File Review Workbook"]
["Table of Contents"]
[]
[]
["TAB 1:",null,"Surveyor Instructions"]
[]
["TAB 2:",null,"File List - completed by NCQA"]
[]
["TAB 3:",null,"File Review Worksheet"]

{"sheet":"Surveyor Instructions","index":1,"n_rows":173,"n_cols":2,"rows_kept":173,"cut":false,"hidden":false,"merged":[[169,1,169,4],[171,1,171,4],[164,1,164,4],[165,1,165,4],[166,1,166,4],[167,1,167,4],[168,1,168,4],[116,0,116,1],[81,0,81,1],[0,0,0,1],[1,0,1,1],[3,0,3,1],[5,1,6,1],[23,0,23,1],[10,0,10,1],[16,0,16,1],[172,1,172,4],[28,0,28,1],[18,0,18,1],[47,0,47,1],[20,0,20,1],[21,0,21,1],[26,0,26,1],[19,0,19,1],[41,0,41,1],[24,0,24,1],[42,0,42,1],[43,0,43,1],[45,0,45,1],[55,0,55,1],[112,0,112,1],[114,0,114,1]]}
["CM File Review Workbook"]
["Surveyor Instructions"]
[]
["File Review Worksheet Overview"]
[]
["Purpose","The purpose of the attached file review worksheet is to evaluate an organization's documented processes for its Case Management program. The applicable standard/elements are QI 5G (Case-Management Files - Initial Assessment) and QI 5H (Case Management Files - Ongoing Management)."]
[]
[]
[null,"These instructions explain how you review the file review sample, including which elements are applicable to the files selected and how files are scored. Prior to the survey, NCQA works with the organization to identify the files for review. These instructions also describe how the file review samples are identified."]
[]
["Helpful Worksheet Features"]
[]
["1. The worksheets are color-coded as follows:"]
[" Gray or colored cells indicate no surveyor input is required. "]
[" Non-shaded or white cells indicate that surveyor input is required. "]
{"$rows_left_out":159}
{"sheet":"File List - completed by NCQA","index":2,"n_rows":46,"n_cols":6,"rows_kept":46,"cut":false,"hidden":false,"merged":[[2,0,2,1],[1,0,1,1],[0,0,0,1],[3,0,3,1]]}
["Organization:"]
["Onsite Date:"]
["Accred Code:"]
[]
[]
[null,"Case ID","Case Active or Closed","Program","Delegate Name, If Applicable","Date Enrolled"]
[1]
[2]
[3]
[4]
[5]
[6]
[7]
[8]
[9]
{"$rows_left_out":32}
{"sheet":"File Review Worksheet","index":3,"n_rows":84,"n_cols":88,"rows_kept":84,"cut":false,"hidden":false,"merged":[[10,74,10,75],[9,11,9,65],[10,61,10,65],[10,66,10,67],[10,68,10,69],[10,70,10,71],[10,72,10,73],[10,26,10,30],[10,41,10,45],[10,46,10,50],[10,51,10,55],[10,56,10,60],[9,66,9,75],[10,31,10,35],[10,36,10,40],[5,2,5,7],[10,11,10,15],[10,16,10,20],[10,21,10,25],[9,4,13,4],[5,10,5,21],[6,10,6,21],[9,6,13,6],[9,7,13,7],[9,8,13,8],[9,9,13,9],[9,10,13,10],[13,11,13,15],[13,16,13,20],[13,21,13,25],[70,0,70,74],[71,0,71,74],[73,5,73,16],[75,5,75,16],[65,0,65,74],[66,0,66,74],[67,0,67,74],[68,0,68,74],[69,0,69,74],[13,26,13,30],[13,31,13,35],[13,36,13,40],[13,41,13,45],[13,46,13,50],[9,76,12,76],[11,11,11,15],[11,16,11,20],[11,21,11,25],[11,26,11,30],[11,31,11,35],[11,36,11,40],[11,41,11,45],[11,46,11,50],[11,51,11,55],[11,66,11,67],[11,68,11,69],[11,70,11,71],[11,72,11,73],[11,74,11,75],[11,56,11,60],[9,0,13,0],[9,1,13,1],[9,2,13,2],[9,3,13,3],[9,5,13,5],[1,2,2,7],[2,9,2,21],[3,2,3,7],[3,10,3,21],[4,2,4,7],[4,10,4,21],[11,61,11,65],[13,61,13,65],[13,74,13,75],[13,51,13,55],[13,66,13,67],[13,68,13,69],[13,70,13,71],[13,72,13,73],[13,56,13,60]]}
["CM File Review Worksheet"]
[]
["Organization Name:",null,null,null,null,null,null,null,null,"Response Key"]
["Surveyor Name",null,null,null,null,null,null,null,null,"Yes =","Evidence of element present (as defined)"]
["Date:",null,null,null,null,null,null,null,null,"No = ","Evidence of element not present "]
[null,null,"Case Management Accreditation",null,null,null,null,null,null,"NA =","File does not meet sample criteria. Use when file is NA; individual factors may not be NA",null,null,null,null,null,null,null,null,null,null,null,null,null,null,null,null,null,null,null,null,null,null,null,null,null,null,null,null,null,null,null,null,null,null,null,null,null,null,null,null,null,null,null,null,null,null,null,null,null,null,null,null,null,null,null,null,null,null,null,null,null,null,null,null,null,null,null,null,null,null,null,null,null,null,null,null,"Health Plan Accreditation"]
[null,null,null,null,null,null,null,null,null,"AC =","File is managed by NCQA Accredited or Certified Delegate",null,null,null,null,null,null,null,null,null,null,null,null,null,null,null,null,null,null,null,null,null,null,null,null,null,null,null,null,null,null,null,null,null,null,null,null,null,null,null,null,null,null,null,null,null,null,null,null,null,null,null,null,null,null,null,null,null,null,null,null,null,null,null,null,null,null,null,null,null,null,null,null,null,null,null,null,"Case Management Accreditation"]
["CONFIRM ALL FINDINGS WITH THE APPROPRIATE STAFF"]
[1,2,3,4,5,6,7,8,9,10,11,"12A","12B",null,null,"12C","13A","13B",null,null,"13C","14A","14B",null,null,"14C","15A","15B",null,null,"15C","16A","16B",null,null,"16C","17A","17B",null,null,"17C",{"$f":"IF(C6 = \"Case Management Accreditation\",\"18A\",\"16A\")","v":"18A"},{"$f":"IF(C6 = \"Case Management Accreditation\",\"18B\",\"16B\")","v":"18B"},null,null,{"$f":"IF(C6 = \"Case Management Accreditation\",\"18C\",\"16C\")","v":"18C"},{"$f":"IF(C6 = \"Case Management Accreditation\",\"19A\",\"17A\")","v":"19A"},{"$f":"IF(C6 = \"Case Management Accreditation\",\"19B\",\"17B\")","v":"19B"},null,null,{"$f":"IF(C6 = \"Case Management Accreditation\",\"19C\",\"17C\")","v":"19C"},{"$f":"IF(C6 = \"Case Management Accreditation\",\"20A\",\"18A\")","v":"20A"},{"$f":"IF(C6 = \"Case Management Accreditation\",\"20C\",\"18B\")","v":"20C"},"21A","21B",{"$f":"IF(C6 = \"Case Management Accreditation\",\"20C\",\"18C\")","v":"20C"},{"$f":"IF(C6 = \"Case Management Accreditation\",\"21A\",\"19A\")","v":"21A"},{"$f":"IF(C6 = \"Case Management Accreditation\",\"21B\",\"19B\")","v":"21B"},"21A","21B",{"$f":"IF(C6 = \"Case Management Accreditation\",\"21C\",\"19C\")","v":"21C"},{"$f":"IF(C6 = \"Case Management Accreditation\",\"22A\",\"20A\")","v":"22A"},{"$f":"IF(C6 = \"Case Management Accreditation\",\"22B\",\"20B\")","v":"22B"},"21A","21B",{"$f":"IF(C6 = \"Case Management Accreditation\",\"22C\",\"20C\")","v":"22C"},{"$f":"IF(C6 = \"Case Management Accreditation\",\"23A\",\"21A\")","v":"23A"},{"$f":"IF(C6 = \"Case Management Accreditation\",\"23B\",\"21B\")","v":"23B"},{"$f":"IF(C6 = \"Case Management Accreditation\",\"24A\",\"22A\")","v":"24A"},{"$f":"IF(C6 = \"Case Management Accreditation\",\"24B\",\"22B\")","v":"24B"},{"$f":"IF(C6 = \"Case Management Accreditation\",\"25A\",\"23A\")","v":"25A"},{"$f":"IF(C6 = \"Case Management Accreditation\",\"25B\",\"23B\")","v":"25B"},{"$f":"IF(C6 = \"Case Management Accreditation\",\"26A\",\"24A\")","v":"26A"},{"$f":"IF(C6 = \"Case Management Accreditation\",\"26B\",\"24B\")","v":"26B"},{"$f":"IF(C6 = \"Case Management Accreditation\",\"27A\",\"25A\")","v":"27A"},{"$f":"IF(C6 = \"Case Management Accreditation\",\"27B\",\"25B\")","v":"27B"},{"$f":"IF(C6 = \"Case Management Accreditation\",\"28\",\"26\")","v":"28"}]
[null,"Case ID","Case \nActive\n or \nClosed?","Program","Delegate, if applicable","Date Enrolled","Date Closed","Enrolled at least 60 days","Date member met eligibility criteria established for program)","Initial Assessment all completed on a single date? (Yes/No)","If Initial Assessment was completed on a single date, enter date below","QI 5G Initial Assessment or Evaluatioon (as factor reads) of:",null,null,null,null,null,null,null,null,null,null,null,null,null,null,null,null,null,null,null,null,null,null,null,null,null,null,null,null,null,null,null,null,null,null,null,null,null,null,null,null,null,null,null,null,null,null,null,null,null,null,null,null,null,null,"QI 5H - Ongoing Management",null,null,null,null,null,null,null,null,null,"COMMENT REQUIRED FOR ANY NA OR NO, INDICATED BY COMMENT CELL TURNING YELLOW\n\nNOTE: In general, NA is used only to when a whole file is NA. NA is not allowed for any individual factor; please check with NCQA and receive policy comfirmation before scoring any factor NA"]
[null,null,null,null,null,null,null,null,null,null,null," Factor 1:",null,null,null,null," Factor 2:",null,null,null,null," Factor 3: ",null,null,null,null," Factor 4: ",null,null,null,null,"Factor 5:",null,null,null,null,"Factor 6: ",null,null,null,null,{"$f":"IF(C6 = \"Case Management Accreditation\",\"Factor 7:\",\"Factor 5:\")","v":"Factor 7:"},null,null,null,null,{"$f":"IF(C6 = \"Case Management Accreditation\",\"Factor 8:\",\"Factor 6:\")","v":"Factor 8:"},null,null,null,null,{"$f":"IF(C6 = \"Case Management Accreditation\",\"Factor 9:\",\"Factor 7:\")","v":"Factor 9:"},null,null,null,null,{"$f":"IF(C6 = \"Case Management Accreditation\",\"Factor 10:\",\"Factor 8:\")","v":"Factor 10:"},null,null,null,null,{"$f":"IF(C6 = \"Case Management Accreditation\",\"Factor 11:\",\"Factor 9:\")","v":"Factor 11:"},null,null,null,null," Factor 1: ",null,"Factor 2: ",null," Factor 3: ",null," Factor 4:",null," Factor 5:"]
[null,null,null,null,null,null,null,null,null,null,null," Initial assessment of member health status, including condition-specific issues",null,null,null,null," Documentation of clinical history, including medications ",null,null,null,null,"Initial assessment of the activities of daily living ",null,null,null,null,"Initial assessment of mental health status, including cognitive functions ",null,null,null,null,"Initial assessment of psychosocial issues ",null,null,null,null,"Evaluation of cultural and linguistic needs, preferences or limitations. ",null,null,null,null,"Evaluation of visual and hearing needs, preferences or limitations. ",null,null,null,null,"Evaluation of caregiver resources and involvement. ",null,null,null,null,"Evaluation of available benefits.",null,null,null,null," Evaluation of available benefits from the organization & community resources",null,null,null,null,"Assessment of life-planning activities.",null,null,null,null,"Development of case management plans, including prioritized goals",null," Identification of barriers to meeting goals and complying with the plans",null,"Development of schedules for follow-up and communication with members ",null," Development and communication of member self-management plans",null,"Assessment of progress against CCM plans and goals, and modification as needed"]
[null,null,null,null,null,null,null,null,null,null,null,"Complete","Date Complete (if not 1 day)",null,null,"Factor Met?","Complete","Date Complete (if not 1 day)",null,null,"Factor Met?","Complete","Date Complete (if not 1 day)",null,null,"Factor Met?","Complete","Date Complete (if not 1 day)",null,null,"Factor Met?","Complete","Date Complete (if not 1 day)",null,null,"Factor Met?","Complete","Date Complete (if not 1 day)",null,null,"Factor Met?","Complete","Date Complete (if not 1 day)",null,null,"Factor Met?","Complete","Date Complete (if not 1 day)",null,null,"Factor Met?","Complete","Date Complete (if not 1 day)",null,null,"Factor Met?","Complete","Date Complete (if not 1 day)",null,null,"Factor Met?","Complete","Date Complete (if not 1 day)",null,null,"Factor Met?","Complete","Factor Met","Complete","Factor Met","Complete","Factor Met","Complete","Factor Met","Complete","Factor Met"]
[null,null,null,null,null,null,null,null,null,null,null,{"$f":"IF(AND(P56=8,P60=8),\"STOP\",IF(P60>=30,\"COMPLETE(30)\",IF(P59>=40,\"COMPLETE(40)\",IF(P60<8,\"DENOM <8\",IF(AND(P60=8,P56<8),\"RATIO <8/8\",\"REVIEW FILES\")))))","v":"DENOM <8"},null,null,null,null,{"$f":"IF(AND(U56=8,U60=8),\"STOP\",IF(U60>=30,\"COMPLETE(30)\",IF(U59>=40,\"COMPLETE(40)\",IF(U60<8,\"DENOM <8\",IF(AND(U60=8,U56<8),\"RATIO <8/8\",\"REVIEW FILES\")))))","v":"DENOM <8"},null,null,null,null,{"$f":"IF(AND(Z56=8,Z60=8),\"STOP\",IF(Z60>=30,\"COMPLETE(30)\",IF(Z59>=40,\"COMPLETE(40)\",IF(Z60<8,\"DENOM <8\",IF(AND(Z60=8,Z56<8),\"RATIO <8/8\",\"REVIEW FILES\")))))","v":"DENOM <8"},null,null,null,null,{"$f":"IF(AND(AE56=8,AE60=8),\"STOP\",IF(AE60>=30,\"COMPLETE(30)\",IF(AE59>=40,\"COMPLETE(40)\",IF(AE60<8,\"DENOM <8\",IF(AND(AE60=8,AE56<8),\"RATIO <8/8\",\"REVIEW FILES\")))))","v":"DENOM <8"},null,null,null,null,{"$f":"IF(AND(AJ56=8,AJ60=8),\"STOP\",IF(AJ60>=30,\"COMPLETE(30)\",IF(AJ59>=40,\"COMPLETE(40)\",IF(AJ60<8,\"DENOM <8\",IF(AND(AJ60=8,AJ56<8),\"RATIO <8/8\",\"REVIEW FILES\")))))","v":"DENOM <8"},null,null,null,null,{"$f":"IF(AND(AO56=8,AO60=8),\"STOP\",IF(AO60>=30,\"COMPLETE(30)\",IF(AO59>=40,\"COMPLETE(40)\",IF(AO60<8,\"DENOM <8\",IF(AND(AO60=8,AO56<8),\"RATIO <8/8\",\"REVIEW FILES\")))))","v":"DENOM <8"},null,null,null,null,{"$f":"IF(AND(AT56=8,AT60=8),\"STOP\",IF(AT60>=30,\"COMPLETE(30)\",IF(AT59>=40,\"COMPLETE(40)\",IF(AT60<8,\"DENOM <8\",IF(AND(AT60=8,AT56<8),\"RATIO <8/8\",\"REVIEW FILES\")))))","v":"DENOM <8"},null,null,null,null,{"$f":"IF(AND(AY56=8,AY60=8),\"STOP\",IF(AY60>=30,\"COMPLETE(30)\",IF(AY59>=40,\"COMPLETE(40)\",IF(AY60<8,\"DENOM <8\",IF(AND(AY60=8,AY56<8),\"RATIO <8/8\",\"REVIEW FILES\")))))","v":"DENOM <8"},null,null,null,null,{"$f":"IF(AND(BD56=8,BD60=8),\"STOP\",IF(BD60>=30,\"COMPLETE(30)\",IF(BD59>=40,\"COMPLETE(40)\",IF(BD60<8,\"DENOM <8\",IF(AND(BD60=8,BD56<8),\"RATIO <8/8\",\"REVIEW FILES\")))))","v":"DENOM <8"},null,null,null,null,{"$f":"IF(AND(BI56=8,BI60=8),\"STOP\",IF(BI60>=30,\"COMPLETE(30)\",IF(BI59>=40,\"COMPLETE(40)\",IF(BI60<8,\"DENOM <8\",IF(AND(BI60=8,BI56<8),\"RATIO <8/8\",\"REVIEW FILES\")))))","v":"DENOM <8"},null,null,null,null,{"$f":"IF(AND(BN56=8,BN60=8),\"STOP\",IF(BN60>=30,\"COMPLETE(30)\",IF(BN59>=40,\"COMPLETE(40)\",IF(BN60<8,\"DENOM <8\",IF(AND(BN60=8,BN56<8),\"RATIO <8/8\",\"REVIEW FILES\")))))","v":"DENOM <8"},null,null,null,null,{"$f":"IF(AND(BP56=8,BP60=8),\"STOP\",IF(BP60=30,\"COMPLETE(30)\",IF(BP59>=40,\"COMPLETE(40)\",IF(BP60<8,\"DENOM <8\",IF(AND(BP60=8,BP56<8),\"RATIO <8/8\",\"REVIEW FILES\")))))","v":"DENOM <8"},null,{"$f":"IF(AND(BR56=8,BR60=8),\"STOP\",IF(BR60=30,\"COMPLETE(30)\",IF(BR59>=40,\"COMPLETE(40)\",IF(BR60<8,\"DENOM <8\",IF(AND(BR60=8,BR56<8),\"RATIO <8/8\",\"REVIEW FILES\")))))","v":"DENOM <8"},null,{"$f":"IF(AND(BT56=8,BT60=8),\"STOP\",IF(BT60=30,\"COMPLETE(30)\",IF(BT59>=40,\"COMPLETE(40)\",IF(BT60<8,\"DENOM <8\",IF(AND(BT60=8,BT56<8),\"RATIO <8/8\",\"REVIEW FILES\")))))","v":"DENOM <8"},null,{"$f":"IF(AND(BV56=8,BV60=8),\"STOP\",IF(BV60=30,\"COMPLETE(30)\",IF(BV59>=40,\"COMPLETE(40)\",IF(BV60<8,\"DENOM <8\",IF(AND(BV60=8,BV56<8),\"RATIO <8/8\",\"REVIEW FILES\")))))","v":"DENOM <8"},null,{"$f":"IF(AND(BX56=8,BX60=8),\"STOP\",IF(BX60=30,\"COMPLETE(30)\",IF(BX59>=40,\"COMPLETE(40)\",IF(BX60<8,\"DENOM <8\",IF(AND(BX60=8,BX56<8),\"RATIO <8/8\",\"REVIEW FILES\")))))","v":"DENOM <8"}]
[1,{"$f":"+'File List - completed by NCQA'!B7","v":0},{"$f":"+'File List - completed by NCQA'!C7","v":0},{"$f":"+'File List - completed by NCQA'!D7","v":0},{"$f":"+'File List - completed by NCQA'!E7","v":"00:00:00"},{"$f":"+'File List - completed by NCQA'!F7","v":"00:00:00"},null,{"$f":"IF('File List - completed by NCQA'!F7=\"\",\"\",IF(AND(C15=\"closed\",G15=\"\"),\"\",IF(AND(C15=\"closed\",(G15-F15)>=60),\"Yes\",IF($C$5=\"\",\"ERROR\",IF(AND(C15=\"active\",($C$5-F15)>=60),\"Yes\",\"No\")))))","v":""},null,null,null,null,null,{"$f":"IF($K15=\"\",\"\",ABS($K15-$I15))","v":""},{"$f":"IF(M15=\"\",\"\",ABS(M15-$I15))","v":""},{"$f":"IF(OR($H15=\"No\",L15=\"NA\"),\"NA\",IF(L15=\"AC\",\"Yes\",IF(L15=\"\",\"\",IF(AND(L15=\"Yes\",N15<=30),\"Yes\",IF(AND(L15=\"Yes\",O15<=30),\"Yes\",\"No\")))))","v":""},null,null,{"$f":"IF($K15=\"\",\"\",ABS($K15-$I15))","v":""},{"$f":"IF(R15=\"\",\"\",ABS(R15-$I15))","v":""},{"$f":"IF(OR($H15=\"No\",Q15=\"NA\"),\"NA\",IF(Q15=\"AC\",\"Yes\",IF(Q15=\"\",\"\",IF(AND(Q15=\"Yes\",S15<=30),\"Yes\",IF(AND(Q15=\"Yes\",T15<=30),\"Yes\",\"No\")))))","v":""},null,null,{"$f":"IF($K15=\"\",\"\",ABS($K15-$I15))","v":""},{"$f":"IF(W15=\"\",\"\",ABS(W15-$I15))","v":""},{"$f":"IF(OR($H15=\"No\",V15=\"NA\"),\"NA\",IF(V15=\"AC\",\"Yes\",IF(V15=\"\",\"\",IF(AND(V15=\"Yes\",X15<=30),\"Yes\",IF(AND(V15=\"Yes\",Y15<=30),\"Yes\",\"No\")))))","v":""},null,null,{"$f":"IF($K15=\"\",\"\",ABS($K15-$I15))","v":""},{"$f":"IF(AB15=\"\",\"\",ABS(AB15-$I15))","v":""},{"$f":"IF(OR($H15=\"No\",AA15=\"NA\"),\"NA\",IF(AA15=\"AC\",\"Yes\",IF(AA15=\"\",\"\",IF(AND(AA15=\"Yes\",AC15<=30),\"Yes\",IF(AND(AA15=\"Yes\",AD15<=30),\"Yes\",\"No\")))))","v":""},null,null,{"$f":"IF($K15=\"\",\"\",ABS($K15-$I15))","v":""},{"$f":"IF(AG15=\"\",\"\",ABS(AG15-$I15))","v":""},{"$f":"IF(OR($H15=\"No\",AF15=\"NA\"),\"NA\",IF(AF15=\"AC\",\"Yes\",IF(AF15=\"\",\"\",IF(AND(AF15=\"Yes\",AH15<=30),\"Yes\",IF(AND(AF15=\"Yes\",AI15<=30),\"Yes\",\"No\")))))","v":""},null,null,{"$f":"IF($K15=\"\",\"\",ABS($K15-$I15))","v":""},{"$f":"IF(AL15=\"\",\"\",ABS(AL15-$I15))","v":""},{"$f":"IF(OR($H15=\"No\",AK15=\"NA\"),\"NA\",IF(AK15=\"AC\",\"Yes\",IF(AK15=\"\",\"\",IF(AND(AK15=\"Yes\",AM15<=30),\"Yes\",IF(AND(AK15=\"Yes\",AN15<=30),\"Yes\",\"No\")))))","v":""},null,null,{"$f":"IF($K15=\"\",\"\",ABS($K15-$I15))","v":""},{"$f":"IF(AQ15=\"\",\"\",ABS(AQ15-$I15))","v":""},{"$f":"IF(OR($H15=\"No\",AP15=\"NA\"),\"NA\",IF(AP15=\"AC\",\"Yes\",IF(AP15=\"\",\"\",IF(AND(AP15=\"Yes\",AR15<=30),\"Yes\",IF(AND(AP15=\"Yes\",AS15<=30),\"Yes\",\"No\")))))","v":""},null,null,{"$f":"IF($K15=\"\",\"\",ABS($K15-$I15))","v":""},{"$f":"IF(AV15=\"\",\"\",ABS(AV15-$I15))","v":""},{"$f":"IF(OR($H15=\"No\",AU15=\"NA\"),\"NA\",IF(AU15=\"AC\",\"Yes\",IF(AU15=\"\",\"\",IF(AND(AU15=\"Yes\",AW15<=30),\"Yes\",IF(AND(AU15=\"Yes\",AX15<=30),\"Yes\",\"No\")))))","v":""},null,null,{"$f":"IF($K15=\"\",\"\",ABS($K15-$I15))","v":""},{"$f":"IF(BA15=\"\",\"\",ABS(BA15-$I15))","v":""},{"$f":"IF(OR($H15=\"No\",AZ15=\"NA\"),\"NA\",IF(AZ15=\"AC\",\"Yes\",IF(AZ15=\"\",\"\",IF(AND(AZ15=\"Yes\",BB15<=30),\"Yes\",IF(AND(AZ15=\"Yes\",BC15<=30),\"Yes\",\"No\")))))","v":""},null,null,{"$f":"IF($K15=\"\",\"\",ABS($K15-$I15))","v":""},{"$f":"IF(BF15=\"\",\"\",ABS(BF15-$I15))","v":""},{"$f":"IF(OR($H15=\"No\",BE15=\"NA\"),\"NA\",IF(BE15=\"AC\",\"Yes\",IF(BE15=\"\",\"\",IF(AND(BE15=\"Yes\",BG15<=30),\"Yes\",IF(AND(BE15=\"Yes\",BH15<=30),\"Yes\",\"No\")))))","v":""},null,null,{"$f":"IF($K15=\"\",\"\",ABS($K15-$I15))","v":""},{"$f":"IF(BK15=\"\",\"\",ABS(BK15-$I15))","v":""},{"$f":"IF(OR($H15=\"No\",BJ15=\"NA\"),\"NA\",IF(BJ15=\"AC\",\"Yes\",IF(BJ15=\"\",\"\",IF(AND(BJ15=\"Yes\",BL15<=30),\"Yes\",IF(AND(BJ15=\"Yes\",BM15<=30),\"Yes\",\"No\")))))","v":""},null,{"$f":"IF($H15=\"No\",\"NA\",IF(BO15=\"AC\",\"Yes\",BO15))","v":0},null,{"$f":"IF($H15=\"No\",\"NA\",IF(BQ15=\"AC\",\"Yes\",BQ15))","v":0},null,{"$f":"IF($H15=\"No\",\"NA\",IF(BS15=\"AC\",\"Yes\",BS15))","v":0},null,{"$f":"IF($H15=\"No\",\"NA\",IF(BU15=\"AC\",\"Yes\",BU15))","v":0},null,{"$f":"IF($H15=\"No\",\"NA\",IF(BW15=\"AC\",\"Yes\",BW15))","v":0},null,{"$f":"COUNTIF(L15:BX15,\"NO\")+COUNTIF(L15:BX15,\"NA\")","v":0}]
{"$rows_left_out":69}